{"text_format":"1","workbook":"xlsx","n_sheets":9,"sheets":["Read me","Exercise","Carbon tax values","Assumptions","Sheet1","Increase","International carbon prices","Carbon tax values FIXED","Allowances"],"not_rendered":{"charts":0,"images":5,"macros":1,"external_links":1,"defined_names":2,"comments":2,"pivot_tables":0},"unopened":[],"bounds":{"document_bytes":16777216,"sheet_cells":100000,"rows_first":2000,"rows_last":500,"rows_between":2000,"halvings":0,"cell_chars":16384,"cell_head_chars":4096},"cells_cut":0,"cells_raw":0,"read":"whole","date_system":"1900"}

{"sheet":"Read me","index":0,"n_rows":36,"n_cols":12,"rows_kept":36,"cut":false,"hidden":false,"merged":[[31,8,32,10],[33,8,33,10],[34,8,34,10],[35,8,35,10],[33,11,33,17],[34,11,34,17],[35,11,35,17],[31,11,32,17],[12,11,12,17],[9,0,12,0],[1,2,2,7],[4,0,5,6],[8,11,9,17],[9,1,9,5],[8,8,9,10],[10,8,10,10],[11,8,11,10],[10,11,10,17],[11,11,11,17]]}
["Carbon Price Pathway Tool"]
["Version",1.7]
["Date","2022-01-26"]
[]
["This Tool is part of a Transition Risk Analysis Support Toolkit developed by the South Africa-UK PACT supported project: Aligning South Africa's Climate-related Financial Disclosure with Global Best Practice"]
[]
{"$rows_left_out":31}
{"sheet":"Exercise","index":1,"n_rows":7,"n_cols":2,"rows_kept":7,"cut":false,"hidden":false,"merged":[]}
["Exercise 1","The South African government has announced that to do our fair share to contain climate change by 1.50C degrees by 2050, the South African carbon tax will have to increase by 20% per year from 2031 to 2050. The expected increase from now to 2030 to meet this goal is consistent with the assumptions used in the UK PACT scenario exercise."]
["Activity","Calculate what the carbon tax value in South Africa is going to be by 2050."]
["Guide","Go to 'Increase' sheet. Cell B2 should be set to 'UK PACT' initially. Copy the values for 'Immediate 1.5 oC' scenario from 2022 to 2030 (B19 to J19) and paste below the table. Use the 'Paste Special - Values' function to paste the actual values. \nChoose 'User input' from the dropdown in cell B2. Yellow cells should become visible. Copy values you pasted below the table into the table in cells B19 to J19 (values for 'Immediate 1.5 oC' scenario for 2022 to 2030). Use 'Paste Special - Values' function again. Insert 20% in cells K19 to AD19.\n\nGo to 'Assumptions' sheet. Select value 'Increase' from the dropdown in cell G15 (forecasting method linked to the 'Immediate 1.5 oC' scenario).\n\nGo to 'Carbon tax values' sheet and find the 2050 carbon tax value in cell AG15. The value should be R26,836.32."]
[]
["Exercise 2","Your policy analyst has looked at this announcement and decided it is unlike to happen in practice. She feels that the carbon tax is much more likely to converge with international carbon prices over time (and in particular eventually align with the carbon price path implicit in the NGFS (2020)’s Immediate 1.5ᵒC with CDR scenario. You decide that this is a better assumption."]
["Activity","Calculate what the carbon tax value in South Africa is going to be by 2050."]
{"$rows_left_out":2}
{"sheet":"Carbon tax values","index":2,"n_rows":23,"n_cols":33,"rows_kept":23,"cut":false,"hidden":false,"merged":[]}
[]
[null,null,null,"Phase_1","Phase_1","Phase_2","Phase_2","Phase_2","Phase_2","Phase_2","Phase_2a","Phase_2a","Phase_2a","Beyond","Beyond","Beyond","Beyond","Beyond","Beyond","Beyond","Beyond","Beyond","Beyond","Beyond","Beyond","Beyond","Beyond","Beyond","Beyond","Beyond","Beyond","Beyond","Beyond"]
[null,null,"Carbon Price (ZAR)",2021,2022,2023,2024,2025,2026,2027,2028,2029,2030,2031,2032,2033,2034,2035,2036,2037,2038,2039,2040,2041,2042,2043,2044,2045,2046,2047,2048,2049,2050]
[null,null,{"$f":"Assumptions!B5","v":"Current Policies"}]
[null,null,"Carbon price",{"$f":"Assumptions!$B$10","v":134},{"$f":"D5*(1+INDEX(Increase!$A$3:$AD$7,MATCH('Carbon tax values'!$C4,Increase!$A$3:$A$7,0),MATCH('Carbon tax values'!E$3,Increase!$A$3:$AD$3,0)))","v":136.68},{"$f":"E5*(1+INDEX(Increase!$A$3:$AD$7,MATCH('Carbon tax values'!$C4,Increase!$A$3:$A$7,0),MATCH('Carbon tax values'!F$3,Increase!$A$3:$AD$3,0)))","v":136.68},{"$f":"F5*(1+INDEX(Increase!$A$3:$AD$7,MATCH('Carbon tax values'!$C4,Increase!$A$3:$A$7,0),MATCH('Carbon tax values'!G$3,Increase!$A$3:$AD$3,0)))","v":136.68},{"$f":"G5*(1+INDEX(Increase!$A$3:$AD$7,MATCH('Carbon tax values'!$C4,Increase!$A$3:$A$7,0),MATCH('Carbon tax values'!H$3,Increase!$A$3:$AD$3,0)))","v":136.68},{"$f":"H5*(1+INDEX(Increase!$A$3:$AD$7,MATCH('Carbon tax values'!$C4,Increase!$A$3:$A$7,0),MATCH('Carbon tax values'!I$3,Increase!$A$3:$AD$3,0)))","v":136.68},{"$f":"I5*(1+INDEX(Increase!$A$3:$AD$7,MATCH('Carbon tax values'!$C4,Increase!$A$3:$A$7,0),MATCH('Carbon tax values'!J$3,Increase!$A$3:$AD$3,0)))","v":136.68},{"$f":"IF(Assumptions!$B$13=\"Combination\",J5+($M$5-$J$5)/COUNT($K$3:$M$3),J5*(1+INDEX(Increase!$A$3:$AD$7,MATCH('Carbon tax values'!$C4,Increase!$A$3:$A$7,0),MATCH('Carbon tax values'!K$3,Increase!$A$3:$AD$3,0))))","v":136.68},{"$f":"IF(Assumptions!$B$13=\"Combination\",K5+($M$5-$J$5)/COUNT($K$3:$M$3),K5*(1+INDEX(Increase!$A$3:$AD$7,MATCH('Carbon tax values'!$C4,Increase!$A$3:$A$7,0),MATCH('Carbon tax values'!L$3,Increase!$A$3:$AD$3,0))))","v":136.68},{"$f":"IF(Assumptions!B13=\"Combination\",Assumptions!C22,L5*(1+INDEX(Increase!$A$3:$AD$7,MATCH('Carbon tax values'!$C4,Increase!$A$3:$A$7,0),MATCH('Carbon tax values'!M$3,Increase!$A$3:$AD$3,0))))","v":136.68},{"$f":"IF(Assumptions!$G$13=\"Target rate\",M5+($AG$5-$M$5)/COUNT($N$3:$AG$3),M5*(1+INDEX(Increase!$A$3:$AD$7,MATCH('Carbon tax values'!$C4,Increase!$A$3:$A$7,0),MATCH('Carbon tax values'!N$3,Increase!$A$3:$AD$3,0))))","v":136.68},{"$f":"IF(Assumptions!$G$13=\"Target rate\",N5+($AG$5-$M$5)/COUNT($N$3:$AG$3),N5*(1+INDEX(Increase!$A$3:$AD$7,MATCH('Carbon tax values'!$C4,Increase!$A$3:$A$7,0),MATCH('Carbon tax values'!O$3,Increase!$A$3:$AD$3,0))))","v":136.68},{"$f":"IF(Assumptions!$G$13=\"Target rate\",O5+($AG$5-$M$5)/COUNT($N$3:$AG$3),O5*(1+INDEX(Increase!$A$3:$AD$7,MATCH('Carbon tax values'!$C4,Increase!$A$3:$A$7,0),MATCH('Carbon tax values'!P$3,Increase!$A$3:$AD$3,0))))","v":136.68},{"$f":"IF(Assumptions!$G$13=\"Target rate\",P5+($AG$5-$M$5)/COUNT($N$3:$AG$3),P5*(1+INDEX(Increase!$A$3:$AD$7,MATCH('Carbon tax values'!$C4,Increase!$A$3:$A$7,0),MATCH('Carbon tax values'!Q$3,Increase!$A$3:$AD$3,0))))","v":136.68},{"$f":"IF(Assumptions!$G$13=\"Target rate\",Q5+($AG$5-$M$5)/COUNT($N$3:$AG$3),Q5*(1+INDEX(Increase!$A$3:$AD$7,MATCH('Carbon tax values'!$C4,Increase!$A$3:$A$7,0),MATCH('Carbon tax values'!R$3,Increase!$A$3:$AD$3,0))))","v":136.68},{"$f":"IF(Assumptions!$G$13=\"Target rate\",R5+($AG$5-$M$5)/COUNT($N$3:$AG$3),R5*(1+INDEX(Increase!$A$3:$AD$7,MATCH('Carbon tax values'!$C4,Increase!$A$3:$A$7,0),MATCH('Carbon tax values'!S$3,Increase!$A$3:$AD$3,0))))","v":136.68},{"$f":"IF(Assumptions!$G$13=\"Target rate\",S5+($AG$5-$M$5)/COUNT($N$3:$AG$3),S5*(1+INDEX(Increase!$A$3:$AD$7,MATCH('Carbon tax values'!$C4,Increase!$A$3:$A$7,0),MATCH('Carbon tax values'!T$3,Increase!$A$3:$AD$3,0))))","v":136.68},{"$f":"IF(Assumptions!$G$13=\"Target rate\",T5+($AG$5-$M$5)/COUNT($N$3:$AG$3),T5*(1+INDEX(Increase!$A$3:$AD$7,MATCH('Carbon tax values'!$C4,Increase!$A$3:$A$7,0),MATCH('Carbon tax values'!U$3,Increase!$A$3:$AD$3,0))))","v":136.68},{"$f":"IF(Assumptions!$G$13=\"Target rate\",U5+($AG$5-$M$5)/COUNT($N$3:$AG$3),U5*(1+INDEX(Increase!$A$3:$AD$7,MATCH('Carbon tax values'!$C4,Increase!$A$3:$A$7,0),MATCH('Carbon tax values'!V$3,Increase!$A$3:$AD$3,0))))","v":136.68},{"$f":"IF(Assumptions!$G$13=\"Target rate\",V5+($AG$5-$M$5)/COUNT($N$3:$AG$3),V5*(1+INDEX(Increase!$A$3:$AD$7,MATCH('Carbon tax values'!$C4,Increase!$A$3:$A$7,0),MATCH('Carbon tax values'!W$3,Increase!$A$3:$AD$3,0))))","v":136.68},{"$f":"IF(Assumptions!$G$13=\"Target rate\",W5+($AG$5-$M$5)/COUNT($N$3:$AG$3),W5*(1+INDEX(Increase!$A$3:$AD$7,MATCH('Carbon tax values'!$C4,Increase!$A$3:$A$7,0),MATCH('Carbon tax values'!X$3,Increase!$A$3:$AD$3,0))))","v":136.68},{"$f":"IF(Assumptions!$G$13=\"Target rate\",X5+($AG$5-$M$5)/COUNT($N$3:$AG$3),X5*(1+INDEX(Increase!$A$3:$AD$7,MATCH('Carbon tax values'!$C4,Increase!$A$3:$A$7,0),MATCH('Carbon tax values'!Y$3,Increase!$A$3:$AD$3,0))))","v":136.68},{"$f":"IF(Assumptions!$G$13=\"Target rate\",Y5+($AG$5-$M$5)/COUNT($N$3:$AG$3),Y5*(1+INDEX(Increase!$A$3:$AD$7,MATCH('Carbon tax values'!$C4,Increase!$A$3:$A$7,0),MATCH('Carbon tax values'!Z$3,Increase!$A$3:$AD$3,0))))","v":136.68},{"$f":"IF(Assumptions!$G$13=\"Target rate\",Z5+($AG$5-$M$5)/COUNT($N$3:$AG$3),Z5*(1+INDEX(Increase!$A$3:$AD$7,MATCH('Carbon tax values'!$C4,Increase!$A$3:$A$7,0),MATCH('Carbon tax values'!AA$3,Increase!$A$3:$AD$3,0))))","v":136.68},{"$f":"IF(Assumptions!$G$13=\"Target rate\",AA5+($AG$5-$M$5)/COUNT($N$3:$AG$3),AA5*(1+INDEX(Increase!$A$3:$AD$7,MATCH('Carbon tax values'!$C4,Increase!$A$3:$A$7,0),MATCH('Carbon tax values'!AB$3,Increase!$A$3:$AD$3,0))))","v":136.68},{"$f":"IF(Assumptions!$G$13=\"Target rate\",AB5+($AG$5-$M$5)/COUNT($N$3:$AG$3),AB5*(1+INDEX(Increase!$A$3:$AD$7,MATCH('Carbon tax values'!$C4,Increase!$A$3:$A$7,0),MATCH('Carbon tax values'!AC$3,Increase!$A$3:$AD$3,0))))","v":136.68},{"$f":"IF(Assumptions!$G$13=\"Target rate\",AC5+($AG$5-$M$5)/COUNT($N$3:$AG$3),AC5*(1+INDEX(Increase!$A$3:$AD$7,MATCH('Carbon tax values'!$C4,Increase!$A$3:$A$7,0),MATCH('Carbon tax values'!AD$3,Increase!$A$3:$AD$3,0))))","v":136.68},{"$f":"IF(Assumptions!$G$13=\"Target rate\",AD5+($AG$5-$M$5)/COUNT($N$3:$AG$3),AD5*(1+INDEX(Increase!$A$3:$AD$7,MATCH('Carbon tax values'!$C4,Increase!$A$3:$A$7,0),MATCH('Carbon tax values'!AE$3,Increase!$A$3:$AD$3,0))))","v":136.68},{"$f":"IF(Assumptions!$G$13=\"Target rate\",AE5+($AG$5-$M$5)/COUNT($N$3:$AG$3),AE5*(1+INDEX(Increase!$A$3:$AD$7,MATCH('Carbon tax values'!$C4,Increase!$A$3:$A$7,0),MATCH('Carbon tax values'!AF$3,Increase!$A$3:$AD$3,0))))","v":136.68},{"$f":"IF(Assumptions!$G$13=\"Target rate\",AF5+($AG$5-$M$5)/COUNT($N$3:$AG$3),AF5*(1+INDEX(Increase!$A$3:$AD$7,MATCH('Carbon tax values'!$C4,Increase!$A$3:$A$7,0),MATCH('Carbon tax values'!AG$3,Increase!$A$3:$AD$3,0))))","v":136.68}]
[null,{"$f":"$C$4&\"-\"&C6","v":"Current Policies-Energy - Power"},"Energy - Power",{"$f":"D$5*(1-INDEX(Allowances!$AA$2:$AE$15,MATCH('Carbon tax values'!$B6,Allowances!$AE$2:$AE$15,0),MATCH('Carbon tax values'!D$2,Allowances!$AA$2:$AE$2,0)))","v":36.354199999999999},{"$f":"E$5*(1-INDEX(Allowances!$AA$2:$AE$15,MATCH('Carbon tax values'!$B6,Allowances!$AE$2:$AE$15,0),MATCH('Carbon tax values'!E$2,Allowances!$AA$2:$AE$2,0)))","v":37.081283999999997},{"$f":"F$5*(1-INDEX(Allowances!$AA$2:$AE$15,MATCH('Carbon tax values'!$B6,Allowances!$AE$2:$AE$15,0),MATCH('Carbon tax values'!F$2,Allowances!$AA$2:$AE$2,0)))","v":42.548484000000002},{"$f":"G$5*(1-INDEX(Allowances!$AA$2:$AE$15,MATCH('Carbon tax values'!$B6,Allowances!$AE$2:$AE$15,0),MATCH('Carbon tax values'!G$2,Allowances!$AA$2:$AE$2,0)))","v":42.548484000000002},{"$f":"H$5*(1-INDEX(Allowances!$AA$2:$AE$15,MATCH('Carbon tax values'!$B6,Allowances!$AE$2:$AE$15,0),MATCH('Carbon tax values'!H$2,Allowances!$AA$2:$AE$2,0)))","v":42.548484000000002},{"$f":"I$5*(1-INDEX(Allowances!$AA$2:$AE$15,MATCH('Carbon tax values'!$B6,Allowances!$AE$2:$AE$15,0),MATCH('Carbon tax values'!I$2,Allowances!$AA$2:$AE$2,0)))","v":42.548484000000002},{"$f":"J$5*(1-INDEX(Allowances!$AA$2:$AE$15,MATCH('Carbon tax values'!$B6,Allowances!$AE$2:$AE$15,0),MATCH('Carbon tax values'!J$2,Allowances!$AA$2:$AE$2,0)))","v":42.548484000000002},{"$f":"K$5*(1-INDEX(Allowances!$AA$2:$AE$15,MATCH('Carbon tax values'!$B6,Allowances!$AE$2:$AE$15,0),MATCH('Carbon tax values'!K$2,Allowances!$AA$2:$AE$2,0)))","v":42.548484000000002},{"$f":"L$5*(1-INDEX(Allowances!$AA$2:$AE$15,MATCH('Carbon tax values'!$B6,Allowances!$AE$2:$AE$15,0),MATCH('Carbon tax values'!L$2,Allowances!$AA$2:$AE$2,0)))","v":42.548484000000002},{"$f":"M$5*(1-INDEX(Allowances!$AA$2:$AE$15,MATCH('Carbon tax values'!$B6,Allowances!$AE$2:$AE$15,0),MATCH('Carbon tax values'!M$2,Allowances!$AA$2:$AE$2,0)))","v":42.548484000000002},{"$f":"N$5*(1-INDEX(Allowances!$AA$2:$AE$15,MATCH('Carbon tax values'!$B6,Allowances!$AE$2:$AE$15,0),MATCH('Carbon tax values'!N$2,Allowances!$AA$2:$AE$2,0)))","v":43.915284000000007},{"$f":"O$5*(1-INDEX(Allowances!$AA$2:$AE$15,MATCH('Carbon tax values'!$B6,Allowances!$AE$2:$AE$15,0),MATCH('Carbon tax values'!O$2,Allowances!$AA$2:$AE$2,0)))","v":43.915284000000007},{"$f":"P$5*(1-INDEX(Allowances!$AA$2:$AE$15,MATCH('Carbon tax values'!$B6,Allowances!$AE$2:$AE$15,0),MATCH('Carbon tax values'!P$2,Allowances!$AA$2:$AE$2,0)))","v":43.915284000000007},{"$f":"Q$5*(1-INDEX(Allowances!$AA$2:$AE$15,MATCH('Carbon tax values'!$B6,Allowances!$AE$2:$AE$15,0),MATCH('Carbon tax values'!Q$2,Allowances!$AA$2:$AE$2,0)))","v":43.915284000000007},{"$f":"R$5*(1-INDEX(Allowances!$AA$2:$AE$15,MATCH('Carbon tax values'!$B6,Allowances!$AE$2:$AE$15,0),MATCH('Carbon tax values'!R$2,Allowances!$AA$2:$AE$2,0)))","v":43.915284000000007},{"$f":"S$5*(1-INDEX(Allowances!$AA$2:$AE$15,MATCH('Carbon tax values'!$B6,Allowances!$AE$2:$AE$15,0),MATCH('Carbon tax values'!S$2,Allowances!$AA$2:$AE$2,0)))","v":43.915284000000007},{"$f":"T$5*(1-INDEX(Allowances!$AA$2:$AE$15,MATCH('Carbon tax values'!$B6,Allowances!$AE$2:$AE$15,0),MATCH('Carbon tax values'!T$2,Allowances!$AA$2:$AE$2,0)))","v":43.915284000000007},{"$f":"U$5*(1-INDEX(Allowances!$AA$2:$AE$15,MATCH('Carbon tax values'!$B6,Allowances!$AE$2:$AE$15,0),MATCH('Carbon tax values'!U$2,Allowances!$AA$2:$AE$2,0)))","v":43.915284000000007},{"$f":"V$5*(1-INDEX(Allowances!$AA$2:$AE$15,MATCH('Carbon tax values'!$B6,Allowances!$AE$2:$AE$15,0),MATCH('Carbon tax values'!V$2,Allowances!$AA$2:$AE$2,0)))","v":43.915284000000007},{"$f":"W$5*(1-INDEX(Allowances!$AA$2:$AE$15,MATCH('Carbon tax values'!$B6,Allowances!$AE$2:$AE$15,0),MATCH('Carbon tax values'!W$2,Allowances!$AA$2:$AE$2,0)))","v":43.915284000000007},{"$f":"X$5*(1-INDEX(Allowances!$AA$2:$AE$15,MATCH('Carbon tax values'!$B6,Allowances!$AE$2:$AE$15,0),MATCH('Carbon tax values'!X$2,Allowances!$AA$2:$AE$2,0)))","v":43.915284000000007},{"$f":"Y$5*(1-INDEX(Allowances!$AA$2:$AE$15,MATCH('Carbon tax values'!$B6,Allowances!$AE$2:$AE$15,0),MATCH('Carbon tax values'!Y$2,Allowances!$AA$2:$AE$2,0)))","v":43.915284000000007},{"$f":"Z$5*(1-INDEX(Allowances!$AA$2:$AE$15,MATCH('Carbon tax values'!$B6,Allowances!$AE$2:$AE$15,0),MATCH('Carbon tax values'!Z$2,Allowances!$AA$2:$AE$2,0)))","v":43.915284000000007},{"$f":"AA$5*(1-INDEX(Allowances!$AA$2:$AE$15,MATCH('Carbon tax values'!$B6,Allowances!$AE$2:$AE$15,0),MATCH('Carbon tax values'!AA$2,Allowances!$AA$2:$AE$2,0)))","v":43.915284000000007},{"$f":"AB$5*(1-INDEX(Allowances!$AA$2:$AE$15,MATCH('Carbon tax values'!$B6,Allowances!$AE$2:$AE$15,0),MATCH('Carbon tax values'!AB$2,Allowances!$AA$2:$AE$2,0)))","v":43.915284000000007},{"$f":"AC$5*(1-INDEX(Allowances!$AA$2:$AE$15,MATCH('Carbon tax values'!$B6,Allowances!$AE$2:$AE$15,0),MATCH('Carbon tax values'!AC$2,Allowances!$AA$2:$AE$2,0)))","v":43.915284000000007},{"$f":"AD$5*(1-INDEX(Allowances!$AA$2:$AE$15,MATCH('Carbon tax values'!$B6,Allowances!$AE$2:$AE$15,0),MATCH('Carbon tax values'!AD$2,Allowances!$AA$2:$AE$2,0)))","v":43.915284000000007},{"$f":"AE$5*(1-INDEX(Allowances!$AA$2:$AE$15,MATCH('Carbon tax values'!$B6,Allowances!$AE$2:$AE$15,0),MATCH('Carbon tax values'!AE$2,Allowances!$AA$2:$AE$2,0)))","v":43.915284000000007},{"$f":"AF$5*(1-INDEX(Allowances!$AA$2:$AE$15,MATCH('Carbon tax values'!$B6,Allowances!$AE$2:$AE$15,0),MATCH('Carbon tax values'!AF$2,Allowances!$AA$2:$AE$2,0)))","v":43.915284000000007},{"$f":"AG$5*(1-INDEX(Allowances!$AA$2:$AE$15,MATCH('Carbon tax values'!$B6,Allowances!$AE$2:$AE$15,0),MATCH('Carbon tax values'!AG$2,Allowances!$AA$2:$AE$2,0)))","v":43.915284000000007}]
{"$rows_left_out":18}
{"sheet":"Assumptions","index":3,"n_rows":43,"n_cols":7,"rows_kept":43,"cut":false,"hidden":false,"merged":[[15,3,15,5],[11,3,11,5],[12,3,12,5],[13,3,13,5],[14,3,14,5]]}
["Carbon tax forecast currency ","USD"]
["Exchange rate (ZAR/unit)",14,"If ZAR above , set value to 1"]
[]
["Scenario names","Scenario names","Scenario description"]
["Baseline","Current Policies","Current Policies"]
["Scenario 1","Immediate 2ᵒC","Immediate 2ᵒC with CDR"]
{"$rows_left_out":38}
{"sheet":"Sheet1","index":4,"n_rows":15,"n_cols":9,"rows_kept":15,"cut":false,"hidden":true,"merged":[[2,3,2,4],[1,2,1,8],[5,3,9,3],[12,3,14,3],[12,4,13,4],[10,2,11,2],[3,3,4,4],[10,3,11,4],[3,2,4,2],[10,8,14,8],[3,6,9,6],[5,2,9,2],[12,2,14,2],[7,4,8,4]]}
[]
[null,null,"Model options and data sources"]
[null,null,"Approaches","Choices in 'Assumptions' sheet",null,"Sources of data 2023-2030","Results"]
[null,null,"Increase over time\n (2023-2030) ","B13:B16 - Increase",null,"UK PACT assumptions","Carbon tax values up to 2030"]
[null,null,null,null,null,"User's own assumptions"]
[null,null,"Combination (2023-2030)\n(Uses 2030 target value to increase carbon tax faster than simply using increase)","B13:B16 -\n Combination",null,"UK PACT assumptions (2023 - 2027)"]
{"$rows_left_out":10}
{"sheet":"Increase","index":5,"n_rows":20,"n_cols":30,"rows_kept":20,"cut":false,"hidden":false,"merged":[]}
["Carbon tax Increase values","UK PACT",null,"NB - if you use 'user input' please make sure to include values for every year. If you want to use scenario values for early years, please copy this from the 'UK PACT' values."]
[]
["Real percent increase in SA carbon tax headline rate (%)",2022,2023,2024,2025,2026,2027,2028,2029,2030,2031,2032,2033,2034,2035,2036,2037,2038,2039,2040,2041,2042,2043,2044,2045,2046,2047,2048,2049,2050]
[{"$f":"Assumptions!$B$5","v":"Current Policies"},{"$f":"IF($B$1=\"UK PACT\",B11,B17)","v":0.02},{"$f":"IF($B$1=\"UK PACT\",C11,C17)","v":0},0,0,0,0,0,0,0,0,0,0,0,0,0,0,0,0,0,0,0,0,0,0,0,0,0,0,0]
[{"$f":"Assumptions!$B$6","v":"Immediate 2ᵒC"},{"$f":"IF($B$1=\"UK PACT\",B12,B18)","v":0.02},0.05,0.05,0.05,0.05,0.05,0.05,0.05,0.05,0.05,0.05,0.05,0.05,0.05,0.05,0.05,0.05,0.05,0.05,0.05,0.05,0.05,0.05,0.05,0.05,0.05,0.05,0.05,0.05]
[{"$f":"Assumptions!$B$7","v":"Immediate 1.5ᵒC"},{"$f":"IF($B$1=\"UK PACT\",B13,B19)","v":0.02},0.05,0.05,0.05,0.05,0.05,0.05,0.05,0.05,0.05,0.05,0.05,0.05,0.05,0.05,0.05,0.05,0.05,0.05,0.05,0.05,0.05,0.05,0.05,0.05,0.05,0.05,0.05,0.05]
{"$rows_left_out":15}
{"sheet":"International carbon prices","index":6,"n_rows":20,"n_cols":31,"rows_kept":20,"cut":false,"hidden":false,"merged":[]}
["Global carbon price data","UK PACT","UK PACT values were obtained from the relevant NGFS (2020) scenarios"]
["Currency",{"$f":"Assumptions!B1","v":"USD"},"NB - if you use 'user input' please make sure to include values for every year. If you want to use scenario values for early years, please copy this from the 'UK PACT' values."]
[]
["Carbon Price (USD)",2021,2022,2023,2024,2025,2026,2027,2028,2029,2030,2031,2032,2033,2034,2035,2036,2037,2038,2039,2040,2041,2042,2043,2044,2045,2046,2047,2048,2049,2050]
[{"$f":"Assumptions!$B$5","v":"Current Policies"},{"$f":"IF($B$1=\"UK PACT\",B11,B17)","v":2.13291531},{"$f":"IF($B$1=\"UK PACT\",C11,C17)","v":2.15445931},2.17600331,2.1975473089999999,2.219091309,2.277847671,2.3366040340000001,2.3953603960000001,2.4541167590000001,2.5128731210000002,2.587107928,2.6613427340000002,2.7355775410000001,2.8098123469999998,2.884047153,2.97535098,3.0666548059999998,3.1579586320000002,3.2492624590000001,3.340566285,3.4464226980000001,3.5522791100000002,3.6581355219999998,3.763991935,3.869848347,3.989877506,4.1099066649999996,4.2299358250000001,4.3499649839999996,4.4699941430000001]
[{"$f":"Assumptions!$B$6","v":"Immediate 2ᵒC"},{"$f":"IF($B$1=\"UK PACT\",B12,B18)","v":3.696902852},11.235077090000001,18.773251330000001,26.311425570000001,33.849599810000001,39.901695080000003,45.953790339999998,52.005885599999999,58.057980860000001,64.110076120000002,70.182255380000001,76.254434630000006,82.326613890000004,88.398793139999995,94.470972399999994,100.5591524,106.6473324,112.7355123,118.8236923,124.9118723,131.81433240000001,138.7167924,145.61925249999999,152.5217126,159.42417270000001,168.2336387,177.04310480000001,185.85257089999999,194.6620369,203.47150300000001]
{"$rows_left_out":15}
{"sheet":"Carbon tax values FIXED","index":7,"n_rows":23,"n_cols":33,"rows_kept":23,"cut":false,"hidden":false,"merged":[]}
[]
[]
[null,null,"Carbon Price (ZAR)",2021,2022,2023,2024,2025,2026,2027,2028,2029,2030,2031,2032,2033,2034,2035,2036,2037,2038,2039,2040,2041,2042,2043,2044,2045,2046,2047,2048,2049,2050]
[null,null,"Current Policies"]
[null,null,"Carbon price",134,136.68,136.68,136.68,136.68,136.68,136.68,136.68,136.68,136.68,136.68,136.68,136.68,136.68,136.68,136.68,136.68,136.68,136.68,136.68,136.68,136.68,136.68,136.68,136.68,136.68,136.68,136.68,136.68,136.68]
[null,null,"Energy - Power",36.354199999999999,37.081283999999997,42.548484000000002,42.548484000000002,42.548484000000002,42.548484000000002,42.548484000000002,42.548484000000002,42.548484000000002,42.548484000000002,43.915284000000007,43.915284000000007,43.915284000000007,43.915284000000007,43.915284000000007,43.915284000000007,43.915284000000007,43.915284000000007,43.915284000000007,43.915284000000007,43.915284000000007,43.915284000000007,43.915284000000007,43.915284000000007,43.915284000000007,43.915284000000007,43.915284000000007,43.915284000000007,43.915284000000007,43.915284000000007]
{"$rows_left_out":18}
{"sheet":"Allowances","index":8,"n_rows":43,"n_cols":31,"rows_kept":43,"cut":false,"hidden":false,"merged":[]}
["Allowance values","UK PACT"]
[null,null,null,null,null,null,null,null,null,null,null,null,null,null,null,null,null,null,null,null,null,null,null,null,null,null,"Phase_1","Phase_2","Phase_2a","Beyond"]
["Scenario","Type of emissions","Basic Allowance\n 2021-2022","Basic Allowance 2023-2027","Basic Allowance 2028-2030","Basic Allowance 2031-2050","Industrial/ Fugitive 2021-2022","Industrial/ Fugitive 2023-2027","Industrial/ Fugitive 2028-2030","Industrial/ Fugitive 2031-2050","Trade exposure 2021-2022","Trade exposure 2023-2027","Trade exposure 2028-2030","Trade exposure 2031-2050","Performance 2021-2022","Performance 2023-2027","Performance 2028-2030","Performance 2031-2050","Carbon budget 2021-2022","Carbon budget 2023-2027","Carbon budget 2028-2030","Carbon budget 2031-2050","Offsets 2021-2022","Offsets 2023-2027","Offsets 2028-2030","Offsets 2031-2050","Total allowances 2021-2022","Total allowances 2023-2027","Total allowances 2028-2030","Total allowances 2031-2050",{"$f":"B3&\" \"&\"by\"&\" \"&A3","v":"Type of emissions by Scenario"}]
[{"$f":"Assumptions!$B$5","v":"Current Policies"},"Energy - Power",{"$f":"IF($B$1=\"UK PACT\",C18,C32)","v":0.6},{"$f":"IF($B$1=\"UK PACT\",D18,D32)","v":0.6},0.6,0.6,0,0,0,0,4.87E-2,4.87E-2,4.87E-2,4.87E-2,0.02,0.01,0.01,0,0.05,0,0,0,0.01,0.03,0.03,0.03,{"$f":"C4+G4+K4+O4+S4+W4","v":0.72870000000000001},{"$f":"D4+H4+L4+P4+T4+X4","v":0.68869999999999998},{"$f":"E4+I4+M4+Q4+U4+Y4","v":0.68869999999999998},{"$f":"F4+J4+N4+R4+V4+Z4","v":0.67869999999999997},{"$f":"A4&\"-\"&B4","v":"Current Policies-Energy - Power"}]
[{"$f":"Assumptions!$B$5","v":"Current Policies"},"Energy - other",{"$f":"IF($B$1=\"UK PACT\",C19,C33)","v":0.6},0.6,0.6,0.6,0,0,0,0,0.09,0.09,0.09,0.09,0.02,0.01,0.01,0,0.05,0,0,0,0.01,0.03,0.03,0.03,{"$f":"C5+G5+K5+O5+S5+W5","v":0.77},{"$f":"D5+H5+L5+P5+T5+X5","v":0.73},{"$f":"E5+I5+M5+Q5+U5+Y5","v":0.73},{"$f":"F5+J5+N5+R5+V5+Z5","v":0.72},{"$f":"A5&\"-\"&B5","v":"Current Policies-Energy - other"}]
[{"$f":"Assumptions!$B$5","v":"Current Policies"},"Industrial process/Fugitive",{"$f":"IF($B$1=\"UK PACT\",C20,C34)","v":0.6},0.6,0.6,0.6,0.1,0.1,0.1,0.1,0.09,0.09,0.09,0.09,0.02,0.01,0.01,0,0.05,0,0,0,0.01,0.03,0.03,0.03,0.87,0.83,0.83,0.82,"Current Policies-Industrial process/Fugitive"]
{"$rows_left_out":37}